1/2 Grosso
type: Concept
type: denomination
definition: Im Spätmittelalter aufkommendes Halbstück des silbernen Grosso.
definition: Half piece of the Grosso introduced during the Late Medieval period. @en
in scheme: denomination
created: 2024-09-17
modified: 2024-09-17