Massa
type: Concept
type: denomination
preferred label: Masha @en
definition: Massa, Masha, Mas oder Mähs. In Indien übliche Bezeichnung einer Gewichtseinheit. Sie wurde auch als Bezeichnung zur Definition von Münzgewichten verwendet und erscheint heute auch als Nominalbezeichnung für einige Gepräge des Indischen Subkontinent.
definition: Massa, Masha, Mas or Mähs. Foremost a unit of weight. Used to describe the weight of certain coins, but today also as a denominational term for some coins in the Indian subcontinent. @en
in scheme: denomination
created: 2024-10-25