Mark
type: Concept
type: denomination
definition: Währungsbezeichnung für neuzeitliche Nominale einschließlich der mit dem Münzgesetz vom 4. Dezember 1871 bzw. dem Münzgesetz vom 9. Juli 1873 (Reichsgoldwährung) eingeführten Mark des Deutschen Recihes. Abgelöst am 15. Oktober 1923 von der Rentenmark.
definition: A term used for various early modern denominations. The German Reich with laws of Dec 4th 1871 and July 9th 1873 resp. introduced the Mark = 100 Pfenninge as the main currency based on the gold standard. Replaced on Oct 15th 1923 by the Rentenmark (although the gold standard was abolished already with the beginning of WWI). @en
in scheme: denomination
created: 2024-05-10
modified: 2024-11-06