2 Florin (doppelter Leopard)
type: Concept
type: denomination
preferred label: 2 Florin (double Leopard) @en
definition: Kurzzeitig von Edward III. 1344 eingeführte Goldmünze im Gewicht von 6,998 g.
in scheme: denomination
created: 2024-05-10
modified: 2024-05-10