Gros tournois
type: Concept
type: denomination
definition: In Frankreich ab 1266 geprägte Münze im Wert von 12 Pfennigen/deniers (grossus denarius Turonus) auf Grundlage der dort üblichen Mark von Tours. Bis in das 16. Jh. auch im Ausland nachgeprägt. Siehe dazu hier unter Turnose (Turnosgroschen).
definition: A silver coins struck in France from 1266 onward with the value of 12 deniers (grossus denarius Turonus), and based of the standard of the mark unit of Tours. It was highly popular and was also copied abroad untill the 16th century. For those copies see Turnose (Turnosgroschen). @en
in scheme: denomination
created: 2024-05-10
modified: 2024-05-10