Plakette
type: Concept
type: item
preferred label: Plaquette @en
definition: Ein kleines Kunstobjekt, welches meist eine viereckige oder quadratische Form hat und anders als eine Medaille zumeist nur auf einer Seite ein Relief oder eine Dekoration trägt.
definition: A plaquette is a small relief object of art, similiar to a medal, but in contrast to a medal frequently only decorated on one side only. It often is of square or angular shape. @en
in scheme: item
created: 2024-05-10
modified: 2024-07-12