Hamburger Kunsthalle
type: Concept
type: owner
definition: The Hamburger Kunsthalle was founded by citizens of Hamburg. Today it is the largest museum in the Hanseatic city and ranks among the most important art museums in Europe. Initiated by collectors and art enthusiasts, Hamburg’s first museum arose from several private collections and was endowed from the outset by civic donations. With the founding of the Kunstverein in 1817, the first art institution in the capital in the North funded by Hamburg’s citizens came into being – whose members were working determinedly towards the establishment of an art museum. In 1863, two donations from Georg Ernst Harzen and Johann Matthias Commeter formed the basis of the Kunsthalle’s collection, in connection with the claim that an exhibition space should be built for it. It was mainly donations from citizens that paved the way for Hamburg’s first museum building to be erected on the former Vincent bastion on the Alsterhöhe and opened in August 1869. The second Kunsthalle building was constructed between 1912 and 1919, and the last building section to date, the Gallery of Contemporary Art, opened in February 1997.The three striking buildings of the Hamburger Kunsthalle, located between the Inner and Outer Alster lakes, house one of the most significant public art collections in Germany today: comprising around 145,000 works of art dating from the 14th century onwards, with around 1,000 works on permanent display. These are complemented by around 6,000 coins, medals and small sculptures, which since 2022 have been recorded, researched and digitised with funding from the Dorit and Alexander Otto Foundation and will be on display in a new collection presentation from 2026. With more than 140,000 works on paper, the Kupferstichkabinett, the Kunsthalle’s department of prints and drawings, is one of the most distinguished in Germany. Its historical study room still serves as the place where works from the collection can be viewed, along with holdings from the art library and the historical… @en
in scheme: owner
created: 2024-05-10
modified: 2026-02-28
creator: mk berlin