Assos, Ausgrabung
type: Concept
type: owner
definition: Münzen, die in Assos gefunden wurden und die sich im dortigen Grabungsdepot oder im Museum Troya befinden. @en
in scheme: owner
created: 2024-05-10
modified: 2024-05-10