Stiftung Hohenzollernscher Kunstbesitz
type: Concept
type: owner
definition: Refers to those objects from the former Hohenzollernmuseum at Schloss Monbijou and other locations which were transferred into the Hohenzollern Art Collection Foundation upon its establishment in 2025.Among them are are those kept in the collection of the Münzkabinett Berlin, which have previously been a part of the Hohenzollernmuseum Schloss Monbijou [in contrast to another set of coins and medals which have been returned to the House of Hohenzollern, see under Hohenzollernmuseum (Schloss Mobijou)]. @en
in scheme: owner
created: 2026-06-11
creator: mk berlin