Wien, Münzkabinett, Kunsthistorisches Museum
type: Concept
type: owner
definition: The Münzkabinett of the Kunsthistorisches Museum Wien (Vienna in Austria) owns over half a million objects which make it one of the largest collections of its kind, and it can be traced back until the 16th century. It holds coins, medals and banknotes, but also coin dies, bonds and primitive money. Not only does the collection house unique rarities and priceless treasures, its abundance and completeness make it an essential tool for fundamental research in Numismatics and History. @en
in scheme: owner
created: 2024-05-10
modified: 2024-05-10