Münster, Archäologisches Museum der Universität
type: Concept
type: owner
definition: The coin collection of the Archaelogical Museum of Münster University consists of more than 5,500 objects covering all historical periods in antiquity: Greek coins (of the archaic, classical and hellenistic periods), coins of the Roman Republic and empire, Civic and provincial coins of the Imperial period, and Byzantine ones. @en
in scheme: owner
created: 2024-05-10
modified: 2024-05-10