Heidelberg Center for Cultural Heritage (HCCH) der Universität
type: Concept
type: owner
definition: The Seminar für Alte Geschichte und Epigraphik of Heidelberg University together with the Institut Klassische Archäologie holds a collection of more than 4,000 Greek and Roman coins. The collection dates back to Georg Friedrich Kreutzer (1771-1858) and grew with later purchases and donations. From the beginning, the collection was conceived to be used for teaching purposes, highlighting the history of coinage from its origins in ancient Greece down to Late Antiquity. @en
in scheme: owner
created: 2024-05-10
modified: 2024-05-10