Institut für Klassische Archäologie der Eberhard Karls Universität Tübingen
type: Concept
type: owner
definition: With over 20,000 objects, the coin collection of the Institute of Classical Archaeology at the University of Tübingen is among the largest university collections of ancient coins in Germany; it is also one of the oldest, its history spanning more than 220 years. Today, the collection contains c. 8,000 Greek, 7,000 Roman, 2,000 Modern coins, and more than 3,000 medals and various other numismatic objects. The collection is made up by three major bequests: Tux (1798), von Schäffer (1888), and Hommel (1975). As such, it mirrors the history of coin collecting from the late Baroque period to the twentieth century. The most prestigious items of the collection are on permanent display at the Museum of the University of Tübingen MUT Alte Kulturen. @en
in scheme: owner
created: 2024-05-10
modified: 2024-05-10