Düsseldorf, Heinrich-Heine-Universität (HHU)
type: Concept
type: owner
definition: The Heinrich-Heine-Universität Düsseldorf (capital of the National State of North Rhine-Westfalia) holds one of the biggest and most comprehensive numismatic collections of ancient coins and medallions at University level in Germany. The core of the collection is represented by some 8,000 coins supplemented by considerable holdings of casts of coins from Asia minor of the Hellenistic (Greek) and Roman Imperial periods. @en
in scheme: owner
created: 2024-05-10
modified: 2024-05-10