Erlangen, Friedrich-Alexander-Universität, Antikensammlung
type: Concept
type: owner
definition: The Friedrich-Alexander-University Erlangen-Nürnberg (FAU) owns roughly 30.000 coins and medals, ranging from Greek and Roman specimens to modern currencies. These originate from various sources, such as the collections of Gerlach, Heerdegen, Luthart, Pick, Sinugowitz, Varnhagen, Voit von Salzburg, Will, Zucker, as well as the items of the “Ilse und Ulrich Zwicker Stiftung”. The Will collection, consisting of about 12.000 pieces, and the Zwicker foundation with its approx. 11.000 objects, make roughly two thirds of the whole lot. The eldest collection was composed by Friedrich Voit von Salzburg between 1845 and 1858. The most recent accession, the objects of the “Ilse und Ulrich Zwicker Stiftung”, took place at the beginning of this century. The chronological and regional emphasis of the coins differs by each collection with a particular focus on antiquity, from the Greek and Romans until the end of the Byzantine times. @en
in scheme: owner
created: 2024-05-10
modified: 2024-05-10