Bochum, Kunstsammlungen der Ruhr-Universität
type: Concept
type: owner
definition: The Numismatic Collection of History Institute of the Faculty of History of the Ruhr-University Bochum consists of more than 3,400 objects covering the whole of Antiquity, from the Archaic Age of Greece to the Byzantine period. In addition, it includes a small Late Mediaeval hoard, which was discovered in Querenburg in 1966 in the course of the construction of the University. @en
in scheme: owner
created: 2024-05-10
modified: 2024-05-10