Frankfurt am Main, Goethe-Universität, Institut für Archäologische Wissenschaften II
type: Concept
type: owner
definition: The coin collections of the Goethe University are located in the Institute for Archaeological Sciences, and reside partly in the Antiquities Collection of Abteilung I (Classical Archaology) and partly in the collections of Abteilung II (Archaeology and History of the Roman Provinces and the Archaeology of Coins, Money and the Economy in the Ancient World). The Antiquities Collection of the Goethe University, based at the Classical Archaeology Department of the Institute for Archaeological Sciences includes around 250 ancient coins alongside a rich collection of ancient vases, glass, lamps, terracottas and other objects. Roman coins form the focus of the coin collection, supplemented by a small number of Greek, Jewish, medieval and modern coins. The coins are regularly used in teaching as study objects, especially for iconographic questions, but also for numismatic identification exercises. The largest part of the numismatic collections of Department II of the Institute for Archaeological Sciences at the Goethe University Frankfurt pertains to around 30,000 plaster cast of ancient coins, encompassing all periods of antiquity. The casts were originally made as research tools for scholars such as Konrad Kraft, Richard Delbrueck and Susanne Grunauer-von Hoerschelmann. A particular strength of the plaster cast collection is lies in the Roman Provincial Coinage. The department also owns two collections of original coins: a teaching collection of around 75 pieces, and a special collection of roman coins with countermarks, encompassing around 300 pieces. @en
in scheme: owner
created: 2024-05-10
modified: 2024-05-10