Greifswald, Akademisches Münzkabinett der Universität
type: Concept
type: owner
definition: The University of Greifswald’s Academic Coin Cabinet comprises 1,200 coins and medals that date from antiquity up until the start of the 20th Century. The core collections are bracteates from the 12th/13th Centuries, coins from German territories of the early modern period and Pomeranian medals awarded for science, art, and history. Further coin collections belonging to the University of Greifswald are held as part of the Gustaf Dalman Collection (on the history of Palestine), the Victor Schultze Collection (on Christian archaeology) and in the collection of prehistoric antiquities. @en
in scheme: owner
created: 2024-05-10
modified: 2024-05-10