Marburg, Archäologisches Seminar der Philipps-Universität
type: Concept
type: owner
definition: The collection of coins of the Archaeological Seminary of the Philipps-University Marburg comprises about 1,000 Greek and Roman coins. It is part of the Antikensammlung, which was founded in 1878 by Ludwig von Sybel (1846-1929), Professor of Classical Archeology. A special enrichment to the collection is the donation from 2017 by Hans-Werner Ritter of nearly 300 well-preserved coins from all eras and regions of Ancient Antiquity. @en
in scheme: owner
created: 2024-05-10
modified: 2024-05-10