Trier, Fach Alte Geschichte der Universität
type: Concept
type: owner
definition: In 2017 Karl-Heinz Zimmer, a water engineer based in Trier, donated his collection of ancient coins to Trier University. This collection, which is now kept with the departement of Ancient History, consists of a total of 515 coins. It was built over several decades and in cooperation with local cultural heritage authorities. The collection does have a local focus, as most of the coins had been struck in the Roman mint of ancient Trier and/or were found in Trier proper, respectively. Many coins hence do have a known findspot; remarkable e.g. are many coins found at the Roman bridge in Trier (Moselbrücke) or those deposited at the Trierweiler temple. The collections thus does not only provide an imporatent teaching tool during University courses, but does represent scientific value in its own right. @en
in scheme: owner
created: 2024-05-10
modified: 2024-05-10