Tomas Butron Miranda
type: Concept
type: person
definition: Edelmetallprüfer in Mexiko-Stadt zwischen 1801 und 1810.Lit.: G. S. Cuhaj - T. Michael, Standard Catalog of World Coins 1801-1900. 6. Auflage (2009) 896.
gender: male
forename: Tomas Butron
surname: Miranda
function or role: Edelmetallprüfer
in scheme: person
created: 2024-05-10
modified: 2024-05-10

Edelmetallprüfer
preferred label: Assayer @en