Henry Hunt
type: Concept
type: person
definition: Farmer und politischer Redner. Parlamentsabgeordneter.Lit.: P. und B. R. Withers, The Token Book. British Tokens of the 17th 18th and 19th centuries and their values (2010) 415 Sussex Nr. 14; W. J. Davis,, The Nineteenth Century Token coinage of Great Britain Ireland the Channel Islands and the Isle of Man to which are added Tokens over one Penny value of any period, (1904/Nachdruck 1969) 141 Nr. 13.
gender: male
forename: Henry
surname: Hunt
date of birth: 1773
date of death: 1835
date of birth and death: 06.11.1773 - 15.02.1835
function or role: Münzherr
in scheme: person
created: 2024-05-10
modified: 2024-05-10

Münzherr
preferred label: Authority @en