S. Lumb
type: Concept
type: person
definition: Textilkaufmann in Leeds. Ausgabe von Marken 1811.Lit.: P. und B. R. Withers, The Token Book. British Tokens of the 17th 18th and 19th centuries and their values (2010) 419 Yorkshire Nr. 18-30.
gender: male
forename: S.
surname: Lumb
function or role: Münzherr
in scheme: person
created: 2024-05-10
modified: 2024-05-10

Münzherr
preferred label: Authority @en