Henry Ryall
type: Concept
type: person
definition: Kerzenmacher und Krämer in Catherine Hill, Frome Selwood, Somersetshire.Henry Ryall war der Vater des Stempelschneiders Henry Thomas Ryall (1807-1867). Ausgabe von Marken 1811, gemeinsam mit Willoughby & Sons, Sinkins, Sparks und Griffith & Gough (alles Kaufleuete in Frome Selwood).Lit.: P. und B. R. Withers, The Token Book. British Tokens of the 17th 18th and 19th centuries and their values (2010) 412 Nr. 71-71 bis; A. W. Waters, Notes on the Silver Tokens of the Nineteenth Century (1957) 12 unter Frome Selwood.
gender: male
forename: Henry
surname: Ryall
date of birth: 1777
date of death: 1840
date of birth and death: 1777-1840
function or role: Münzherr
in scheme: person
created: 2024-05-10
modified: 2024-05-10

Münzherr
preferred label: Authority @en