John Cartwright
type: Concept
type: person
definition: John Cartwright, Schuhmacher in Stafford, Staffordshire.Ausgabe von Marken 1811. Dort mit Initialen J C.Lit.: P. und B. R. Withers, The Token Book. British Tokens of the 17th 18th and 19th centuries and their values (2010) 413 Nr. 14-16.
gender: male
forename: John
surname: Cartwright
function or role: Münzherr
in scheme: person
created: 2024-05-10
modified: 2024-05-10

Münzherr
preferred label: Authority @en