Isaac Cook
type: Concept
type: person
definition: Krämer sowie Spirituosenhändler in 20 High Street, Bridlington.Ausgabe von Marken 1811 und 1812, gemeinsam mit Robert Harwood.Lit.: P. und B. R. Withers, The Token Book. British Tokens of the 17th 18th and 19th centuries and their values (2010) 418 Nr. 5; A.W. Waters, Notes on the Silver Tokens of the Nineteenth Century (1957) 16 unter Bridlington.
gender: male
forename: Isaac
surname: Cook
function or role: Münzherr
in scheme: person
created: 2024-05-10
modified: 2024-05-10

Münzherr
preferred label: Authority @en