Thomas Ching
type: Concept
type: person
definition: Chemiker in Broad Street, Launceston, Cornwall. Dreifacher Bürgermeister von Launceston.Ausgabe von Marken 1811 gemeinsam mit William & George Pearse, Henry Nichols und John Prockter.Lit.: W. J. Davis, The Nineteenth Century Token coinage of Great Britain Ireland the Channel Islands and the Isle of Man to which are added Tokens over one Penny value of any period (1904/Nachdruck 1969) 33 Nr. 7: A. W. Waters, Notes on the Silver Tokens of the Nineteenth Century (1957) 2 unter Launceston; P. und B. R. Withers, The Token Book. British Tokens of the 17th 18th and 19th centuries and their values (2010) 391 Nr. 7.
gender: male
forename: Thomas
surname: Ching
function or role: Münzherr
in scheme: person
created: 2024-05-10
modified: 2024-05-10

Münzherr
preferred label: Authority @en