Gibert Gilpin
type: Concept
type: person
definition: In frühen Jahren Mitarbeiter des Erfinders John Wilkinson.Gewinnt 1805 den Preis der Mechanik-Sektion der Society of Arts für „an improved crane and flexible chain“. Danach Kettenschmied und Eisenhändler in Dawley.Ausgabe von Marken 1811, 1 Shilling und Halfpenny in Dawley, Shropshire.Lit.: W. J. Davis, The Nineteenth Century Token coinage of Great Britain Ireland the Channel Islands and the Isle of Man to which are added Tokens over one Penny value of any period (1904/Nachdruck 1969) 94 Nr. 2.
gender: male
forename: Gibert
surname: Gilpin
date of birth: 1766
date of death: 1827
date of birth and death: 1766-1827
function or role: Münzherr
in scheme: person
created: 2024-05-10
modified: 2024-05-10

Münzherr
preferred label: Authority @en