Tardani
type: Concept
type: person
definition: Italienischer Münzfälscher.Stempel bei privat, im Museo Nazionale Romano und im Smithsonian Institution.Lit.: MEC I 335; W. G. Sayles, Classical deception. Counterfeits, forgeries and reproductions of ancient coins (2001) 53 f.
gender: male
surname: Tardani
date of death: 1929
date of birth and death: -1929
function or role: Fälscher
in scheme: person
created: 2024-05-10
modified: 2024-05-10

Fälscher
preferred label: Counterfeiter @en