Xiumoba/Inaba (1. Jh. n. Chr.), König von Khotan
type: Concept
type: person
preferred label: Xiumoba/Inaba (1st century AD), king of Khotan @en
definition: Lit.: J. Cribb, The Sino-Kharosthi Coins of Khotan, Their Attribution and Relevance to Kushan Chronology. Part 1, Numismatic Chronicle 1984, 129-152; The Sino-Kharosthi Coins of Khotan, Their Attribution and Relevance to Kushan Chronology. Part 2, Numismatic Chronicle 1985, 136-149). - Zur Datierung ebd. 1985, 137-139 (2. Phase, 60-70 n. Chr.?).
gender: male
surname: Xiumoba/Inaba (1. Jh. n. Chr.), König von Khotan
surname: Xiumoba/Inaba (1st century AD), king of Khotan @en
function or role: Münzherr
in scheme: person
created: 2024-05-10
modified: 2024-05-10

Münzherr
preferred label: Authority @en