Klaus-Peter Dahmen
type: Concept
type: person
definition: Deutscher Elektroingenier (grad.).Zuletzt Direktor Investionsmanagement Thyssen Krupp NIROSTA GmbH in Krefeld.
gender: male
forename: Klaus-Peter
surname: Dahmen
date of birth: 1944
date of death: 2022
date of birth and death: 18.02.1944 - 04.09.2022
function or role: Dargestellte/r
in scheme: person
created: 2026-05-06
creator: mk berlin

Dargestellte/r
preferred label: Sitter @en