L. Livius Salinator
type: Concept
type: person
definition: Münzmeister RRC Nr. 355 im Jahre 84 v. Chr.
gender: male
surname: L. Livius Salinator
date of death: -81
date of birth and death: -81 v. Chr.
function or role: Münzmeister (MM Ant)
in scheme: person
created: 2025-09-18
modified: 2025-09-18
creator: mk berlin

Münzmeister (MM Ant)
preferred label: Mintmaster (MM Ant) @en