Collon
type: Concept
type: person
definition: Ein Herr Collon erscheint 1903 als namentlich Geehrter auf einer französischen Medaille der Pariser Gesellschaft für Tierschutz.
gender: male
surname: Collon
function or role: Geehrte/r (ohne Bildnis)
in scheme: person
created: 2025-09-24
modified: 2025-09-24
creator: mk berlin

Geehrte/r (ohne Bildnis)
preferred label: honored person (no portrait) @en