Xen.../Xeno...
type: Concept
type: person
definition: Magistrat in Olbia/Sarmatia zwischen ca. 380 und 340 v. Chr.Lit.: W. Leschhorn, Lexikon der Aufschriften auf griechischen Münzen II (2009) 721 (350-300 v. Chr.).
gender: male
surname: Xen.../Xeno...
function or role: Magistrat (Ant)
in scheme: person
created: 2025-09-30
creator: mk berlin

Magistrat (Ant)
preferred label: Magistrate (Ant) @en