Aurelius Dionysios der Jüngere
type: Concept
type: person
preferred label: Aurelius Dionysios the Younger @en
definition: Aurelius Dionysios Neos.Stratege in Perperene/Mysien unter Philippus Arabs.Sein Name erscheint immer in Kombination mit seiner Amtsbezeichnung.Lit.: W. Leschhorn, Lexikon der Aufschriften auf griechischen Münzen II (2009) 393.
gender: male
surname: Aurelius Dionysios der Jüngere
surname: Aurelius Dionysios the Younger @en
function or role: Strategos
in scheme: person
created: 2025-10-02
creator: mk berlin