Jacobo Gottifredo
type: Concept
type: person
definition: Leibarzt der Päpste Paulus II. und Sixtus IV.
gender: male
forename: Jacobo
surname: Gottifredo
date of death: 1482
date of birth and death: -1482
function or role: Geehrte/r (ohne Bildnis)
in scheme: person
created: 2025-10-07
modified: 2025-10-07
creator: mk berlin

Geehrte/r (ohne Bildnis)
preferred label: honored person (no portrait) @en