Olym...
type: Concept
type: person
definition: Magistrat in Kallatis/Thrakien im 3. und 2. Jahrhundert v. Chr. Lit.: W. Leschhorn, Lexikon der Aufschriften auf griechischen Münzen II (2009) 728 (3./2. Jh. v. Chr.).
gender: male
surname: Olym...
function or role: Magistrat (Ant)
in scheme: person
created: 2025-10-28
modified: 2025-11-21
creator: mk berlin

Magistrat (Ant)
preferred label: Magistrate (Ant) @en