Po...
type: Concept
type: person
definition: Magistrat in Kallatis/Thrakien zwischen 250 und 225 v. Chr. auf Tetradrachmen im Typus Alexander des Großen. Lit.: W. Leschhorn, Lexikon der Aufschriften auf griechischen Münzen II (2009) 759 mit Anm. 6 (250-225 v. Chr.); M. J. Price, The coinage in the name of Alexander the Great and Philip Arrhidaeus (1991) Nr. 942.
gender: male
surname: Po...
function or role: Magistrat (Ant)
in scheme: person
created: 2025-10-28
creator: mk berlin

Magistrat (Ant)
preferred label: Magistrate (Ant) @en