Urban Hjärne
type: Concept
type: person
definition: Schwedischer Arzt, Alchemist, Geologe, Schriftsteller und Naturforscher.
gender: male
forename: Urban
surname: Hjärne
date of birth: 1641
date of death: 1724
date of birth and death: 20.12.1641 - 10.05.1724
function or role: Dargestellte/r
in scheme: person
created: 2025-10-29
creator: mk berlin

Dargestellte/r
preferred label: Sitter @en