Dr. Adolf Hoffmann
type: Concept
type: person
definition: Öeterreichischer Mediziner und Münzsammler.
gender: male
prefix: Dr.
forename: Adolf
surname: Hoffmann
date of birth: 1822
date of death: 1909
date of birth and death: 28.03.1822 - 20.11.1909
function or role: Vorbesitzer
function or role: Dargestellte/r
in scheme: person
created: 2025-10-29
modified: 2025-10-29
creator: mk berlin

Vorbesitzer
preferred label: previous Owner @en

Dargestellte/r
preferred label: Sitter @en