Heinrich Hoffmann
type: Concept
type: person
definition: Deutscher Psychiater, Lyriker und Kinderbuchautor.
gender: male
forename: Heinrich
surname: Hoffmann
date of birth: 1809
date of death: 1894
date of birth and death: 13.06.1809 - 20.09.1894
function or role: Dargestellte/r
in scheme: person
created: 2025-10-29
creator: mk berlin

Dargestellte/r
preferred label: Sitter @en