Philemon Holland
type: Concept
type: person
definition: Englischer Schulmeister, Arzt und Übersetzer
gender: male
forename: Philemon
surname: Holland
date of birth: 1552
date of death: 1637
date of birth and death: 1552-09.02.1637
function or role: Dargestellte/r
in scheme: person
created: 2025-10-30
creator: mk berlin

Dargestellte/r
preferred label: Sitter @en