Dr. Emil Holub
type: Concept
type: person
definition: Böhmisch-österreichischer Arzt, Forschungsreisender and Ethnograph.
gender: male
prefix: Dr.
forename: Emil
surname: Holub
date of birth: 1847
date of death: 1902
date of birth and death: 07.10.1847 - 21.02.1902
function or role: Dargestellte/r
in scheme: person
created: 2025-10-30
creator: mk berlin

Dargestellte/r
preferred label: Sitter @en