Prof. E. J. Hopkins
type: Concept
type: person
definition: Britischer Arzt, Professor der Geburtshilfe in London, belegt im ersten Viertel des 19. Jahrhunderts.
gender: male
prefix: Prof.
forename: E. J.
surname: Hopkins
function or role: Dargestellte/r
in scheme: person
created: 2025-10-30
modified: 2025-10-30
creator: mk berlin

Dargestellte/r
preferred label: Sitter @en