Dr. Adriaen de Jonghe
type: Concept
type: person
definition: Niederländischer Humanist und Arzt.Auch bekannt als Hadrianus Junius.
gender: male
prefix: Dr.
forename: Adriaen de
surname: Jonghe
date of birth: 1511
date of death: 1575
date of birth and death: 01.07.1511 - 16.06.1575
function or role: Dargestellte/r
in scheme: person
created: 2025-10-31
creator: mk berlin

Dargestellte/r
preferred label: Sitter @en