Abel-Marcel Hue
type: Concept
type: person
definition: Französischer Arzt in der zweiten Hälfte des 19. Jahrhunderts.
gender: male
forename: Abel-Marcel
surname: Hue
function or role: Dargestellte/r
in scheme: person
created: 2025-10-31
creator: mk berlin

Dargestellte/r
preferred label: Sitter @en