Freiherr Joseph Franz von Jacquin
type: Concept
type: person
preferred label: Baron Joseph Franz von Jacquin @en
definition: Österreichischer Botaniker und Chemiker.
gender: male
prefix: Freiherr
prefix: Baron @en
forename: Joseph Franz von
surname: Jacquin
date of birth: 1766
date of death: 1839
date of birth and death: 07.02.1766 - 04.12.1839
function or role: Dargestellte/r
in scheme: person
created: 2025-10-31
creator: mk berlin

Dargestellte/r
preferred label: Sitter @en