Heinrich von Eickstedt zu Wartekow
type: Concept
type: person
definition: Eickstedt erwarb 1828 das Rittergut Wartekow (heute Wartkowo).Fund von 248 Silbermünzen im Jahre 1835 bei Anlage des Vorwerks Eickstedtwalde heute Dargocice).
gender: male
forename: Heinrich von
surname: Eickstedt zu Wartekow
date of birth: 1788
date of death: 1867
date of birth and death: 1788-1867
function or role: Vorbesitzer
in scheme: person
created: 2025-10-31
modified: 2025-10-31
creator: mk berlin

Vorbesitzer
preferred label: previous Owner @en