Jeanne Strenz
type: Concept
type: person
definition: Französische Bildhauerin und Medailleurin.
gender: female
forename: Jeanne
surname: Strenz
date of birth: 1873
date of death: 1962
date of birth and death: 11.02.1873 - 19.03.1962
function or role: Medailleur/in
in scheme: person
created: 2025-10-31
modified: 2025-10-31
creator: mk berlin

Medailleur/in
preferred label: Medalist @en