Kassner
type: Concept
type: person
definition: Fleischermeister Kassner in Salesche.Auswahl aus einem Münzfund.Ankauf für das Münzkabinett Berlin im Jahre 1919.
gender: male
surname: Kassner
function or role: Veräußerer (an Museum)
in scheme: person
created: 2025-10-31
modified: 2025-10-31
creator: mk berlin

Veräußerer (an Museum)
preferred label: Vendor (to Museum) @en